Target
Mannose-6-phosphate isomerase
Ligand
BDBM34937
Substrate
Mannose-6-phosphate
Meas. Tech.
HTS identification of compounds inhibiting phosphomannose isomerase (PMI) via a fluorescence intensity assay using a high concentration of mannose 6-phosphate
pH
7.4±n/a
Temperature
296.15±n/a K
IC50
>50000±0 nM
Citation
 PubChem, PC HTS identification of compounds inhibiting phosphomannose isomerase (PMI) via a fluorescence intensity assay using a high concentration of mannose 6-phosphate PubChem Bioassay (2009)[AID] 
Target
Name:
Mannose-6-phosphate isomerase
Synonyms:
MPI MPI_HUMAN PMI1
Type:
PROTEIN
Mol. Mass.:
46651.35
Organism:
Homo sapiens (Human)
Description:
ChEMBL_1448919
Residue:
423
  
Inhibitor
Name:
BDBM34937
Synonyms:
4-[5-(2-hydroxyethylamino)-4-nitro-2,1,3-benzoxadiazol-7-yl]-1-piperazinecarboxylic acid ethyl ester MLS000729747 cid_5206473 ethyl 4-{6-[(2-hydroxyethyl)amino]-7-nitro-2,1,3-benzoxadiazol-4-yl}piperazine-1-carboxylate
Type:
Small organic molecule
Emp. Form.:
C15H20N6O6
Mol. Mass.:
380.3559
SMILES:
CCOC(=O)N1CCN(CC1)c1cc(NCCO)c([N+]([O-])=O)c2nonc12
:
Substrate
Name:
Mannose-6-phosphate
Synonyms:
Type:
Mol. Mass.:
358.43
Organism:
Description:
Residue:
3
NA