Target
Epithelial discoidin domain-containing receptor 1
Ligand
BDBM401214
Substrate
Meas. Tech.
LanthaScreen Assay
IC50
31.0±n/a nM
Citation
 Murata, THara, SNiizuma, SHada, KKawada, HSakaitani, MShimada, HNakanishi, Y Quinazolinone and isoquinolinone derivative US Patent  US10005739 Publication Date 6/26/2018 
Target
Name:
Epithelial discoidin domain-containing receptor 1
Synonyms:
CAK DDR1_HUMAN Discoidin domain-containing receptor 1 (DDR1) EDDR1 Epithelial discoidin domain receptor 1 (DDR1) Epithelial discoidin domain-containing receptor 1 (DDR1) Mammary carcinoma kinase 10 NTRK4 Protein-tyrosine kinase RTK 6 TRKE | Tyrosine-protein kinase CAK
Type:
Tyrosine-protein kinase
Mol. Mass.:
101130.02
Organism:
Homo sapiens (Human)
Description:
Q08345
Residue:
913
  
Inhibitor
Name:
BDBM401214
Synonyms:
3-[(5-Chloro-2-ethylsulfonylphenyl)methyl]-8-methyl-7-[[(3S)-3-(methylamino)piperidin-1-yl]methyl]-6-(trifluoromethyl)quinazolin-4-one | US10005739, Example 639
Type:
Small organic molecule
Emp. Form.:
C26H30ClF3N4O3S
Mol. Mass.:
571.055
SMILES:
CCS(=O)(=O)c1ccc(Cl)cc1Cn1cnc2c(C)c(CN3CCC[C@@H](C3)NC)c(cc2c1=O)C(F)(F)F
: