Target
Protein kinase C delta type
Ligand
BDBM35116
Substrate
PKC Peptide Substrate
Meas. Tech.
PKC IMAP Kinase Assay
IC50
690±n/a nM
Citation
 Tumey, LNBhagirath, NBrennan, ABrooijmans, NLee, JYang, XBoschelli, DH 5-Vinyl-3-pyridinecarbonitrile inhibitors of PKCtheta: optimization of enzymatic and functional activity. Bioorg Med Chem 17:7933-48 (2009)  
Target
Name:
Protein kinase C delta type
Synonyms:
KPCD_HUMAN PKCD Protein Kinase C- delta nPKC-delta
Type:
Enzyme
Mol. Mass.:
77516.79
Organism:
Homo sapiens (Human)
Description:
The recombinant human PKC enzymes were produced using a baculovirus expression system in SF9 cells
Residue:
676
  
Inhibitor
Name:
BDBM35116
Synonyms:
5-vinyl-3-pyridinecarbonitrile, 4a
Type:
Small organic molecule
Emp. Form.:
C23H25N5
Mol. Mass.:
371.4781
SMILES:
Cc1c(Nc2c(\C=C\CN3CCCCC3)cncc2C#N)ccc2[nH]ccc12
:
Substrate
Name:
PKC Peptide Substrate
Synonyms:
Type:
Fluorescent peptide
Mol. Mass.:
2051.95
Organism:
Description:
Residue:
17
FAMRFARKGSLRQKNVH