Target
Methionine aminopeptidase 2
Ligand
BDBM401282
Substrate
Meas. Tech.
Activity Assay
IC50
5500±n/a nM
Citation
 Heinrich, TZenke, FRohdich, FFriese-Hamim, MHahn, D Pyrrolidinone derivatives as MetAP-2 inhibitors US Patent  US10005756 Publication Date 6/26/2018 
Target
Name:
Methionine aminopeptidase 2
Synonyms:
Initiation factor 2-associated 67 kDa glycoprotein MAP2_HUMAN MNPEP Methionine aminopeptidase 2 (MetAP2) P67EIF2 p67
Type:
Enzyme
Mol. Mass.:
52884.45
Organism:
Homo sapiens (Human)
Description:
P50579
Residue:
478
  
Inhibitor
Name:
BDBM401282
Synonyms:
US10005756, Compound A49
Type:
Small organic molecule
Emp. Form.:
C21H16ClF4N3O3
Mol. Mass.:
469.817
SMILES:
O[C@]1(CCN(C1=O)c1ccc2[nH]c(cc2c1)C(F)(F)F)C(=O)NCc1cc(F)cc(Cl)c1
: