Target
Sodium channel protein type 9 subunit alpha
Ligand
BDBM401403
Substrate
Meas. Tech.
FLIPR Assay
IC50
67.0±19 nM
Citation
 Yao, JTafesse, L Carboxamide derivatives and use thereof US Patent  US10005768 Publication Date 6/26/2018 
Target
Name:
Sodium channel protein type 9 subunit alpha
Synonyms:
NENA Peripheral sodium channel 1 SCN9A_HUMAN Voltage-gated sodium channel subunit Nav1.7 hNE-Na
Type:
Protein
Mol. Mass.:
226375.97
Organism:
Homo sapiens (Human)
Description:
Q15858
Residue:
1988
  
Inhibitor
Name:
BDBM401403
Synonyms:
6-(4-(4-cyano-2-(1-methyl-1H- pyrrol-2-yl)phenoxy)phenyl)- picolinamide | US10005768, Compound 17
Type:
Small organic molecule
Emp. Form.:
C24H18N4O2
Mol. Mass.:
394.4253
SMILES:
Cn1cccc1-c1cc(ccc1Oc1ccc(cc1)-c1cccc(n1)C(N)=O)C#N
: