Target
Sodium channel protein type 9 subunit alpha
Ligand
BDBM401404
Substrate
Meas. Tech.
FLIPR Assay
IC50
426±84 nM
Citation
 Yao, JTafesse, L Carboxamide derivatives and use thereof US Patent  US10005768 Publication Date 6/26/2018 
Target
Name:
Sodium channel protein type 9 subunit alpha
Synonyms:
NENA Peripheral sodium channel 1 SCN9A_HUMAN Voltage-gated sodium channel subunit Nav1.7 hNE-Na
Type:
Protein
Mol. Mass.:
226375.97
Organism:
Homo sapiens (Human)
Description:
Q15858
Residue:
1988
  
Inhibitor
Name:
BDBM401404
Synonyms:
6-(4-((4'-amino-5-cyano-[1,1'- biphenyl]-2-yl)oxy)phenyl)- picolinamide | US10005768, Compound 18
Type:
Small organic molecule
Emp. Form.:
C25H18N4O2
Mol. Mass.:
406.436
SMILES:
NC(=O)c1cccc(n1)-c1ccc(Oc2ccc(cc2-c2ccc(N)cc2)C#N)cc1
: