Target
Sodium channel protein type 9 subunit alpha
Ligand
BDBM401412
Substrate
Meas. Tech.
FLIPR Assay
IC50
54.0±5 nM
Citation
 Yao, JTafesse, L Carboxamide derivatives and use thereof US Patent  US10005768 Publication Date 6/26/2018 
Target
Name:
Sodium channel protein type 9 subunit alpha
Synonyms:
NENA Peripheral sodium channel 1 SCN9A_HUMAN Voltage-gated sodium channel subunit Nav1.7 hNE-Na
Type:
Protein
Mol. Mass.:
226375.97
Organism:
Homo sapiens (Human)
Description:
Q15858
Residue:
1988
  
Inhibitor
Name:
BDBM401412
Synonyms:
6-(4-(4-cyano-3-(pyridin-4- yl)phenoxy)phenyl)picolinamide | US10005768, Compound 26
Type:
Small organic molecule
Emp. Form.:
C24H16N4O2
Mol. Mass.:
392.4094
SMILES:
NC(=O)c1cccc(n1)-c1ccc(Oc2ccc(C#N)c(c2)-c2ccncc2)cc1
: