Target
Sodium channel protein type 9 subunit alpha
Ligand
BDBM401415
Substrate
Meas. Tech.
FLIPR Assay
IC50
117±36 nM
Citation
 Yao, JTafesse, L Carboxamide derivatives and use thereof US Patent  US10005768 Publication Date 6/26/2018 
Target
Name:
Sodium channel protein type 9 subunit alpha
Synonyms:
NENA Peripheral sodium channel 1 SCN9A_HUMAN Voltage-gated sodium channel subunit Nav1.7 hNE-Na
Type:
Protein
Mol. Mass.:
226375.97
Organism:
Homo sapiens (Human)
Description:
Q15858
Residue:
1988
  
Inhibitor
Name:
BDBM401415
Synonyms:
6-(4-(2-(pyridin-3-yl)-4- (trifluoromethyl)phenoxy)phenyl) picolinamide | US10005768, Compound 29
Type:
Small organic molecule
Emp. Form.:
C24H16F3N3O2
Mol. Mass.:
435.3979
SMILES:
NC(=O)c1cccc(n1)-c1ccc(Oc2ccc(cc2-c2cccnc2)C(F)(F)F)cc1
: