Target
Sodium channel protein type 9 subunit alpha
Ligand
BDBM401419
Substrate
Meas. Tech.
FLIPR Assay
IC50
221±49 nM
Citation
 Yao, JTafesse, L Carboxamide derivatives and use thereof US Patent  US10005768 Publication Date 6/26/2018 
Target
Name:
Sodium channel protein type 9 subunit alpha
Synonyms:
NENA Peripheral sodium channel 1 SCN9A_HUMAN Voltage-gated sodium channel subunit Nav1.7 hNE-Na
Type:
Protein
Mol. Mass.:
226375.97
Organism:
Homo sapiens (Human)
Description:
Q15858
Residue:
1988
  
Inhibitor
Name:
BDBM401419
Synonyms:
6-(4-(2-((4-methylpiperazin-1- yl)methyl)-4-(trifluoromethyl)- phenoxy)phenyl)picolinamide | US10005768, Compound 33
Type:
Small organic molecule
Emp. Form.:
C25H25F3N4O2
Mol. Mass.:
470.4868
SMILES:
CN1CCN(Cc2cc(ccc2Oc2ccc(cc2)-c2cccc(n2)C(N)=O)C(F)(F)F)CC1
: