Target
Sodium channel protein type 9 subunit alpha
Ligand
BDBM401422
Substrate
Meas. Tech.
FLIPR Assay
IC50
432±131 nM
Citation
 Yao, JTafesse, L Carboxamide derivatives and use thereof US Patent  US10005768 Publication Date 6/26/2018 
Target
Name:
Sodium channel protein type 9 subunit alpha
Synonyms:
NENA Peripheral sodium channel 1 SCN9A_HUMAN Voltage-gated sodium channel subunit Nav1.7 hNE-Na
Type:
Protein
Mol. Mass.:
226375.97
Organism:
Homo sapiens (Human)
Description:
Q15858
Residue:
1988
  
Inhibitor
Name:
BDBM401422
Synonyms:
(S)-6-(4-(2-((3- hydroxypyrrolidin-1-yl)methyl)- 4-(trifluoromethyl)- phenoxy)phenyl)picolinamide | US10005768, Compound 36
Type:
Small organic molecule
Emp. Form.:
C24H22F3N3O3
Mol. Mass.:
457.445
SMILES:
NC(=O)c1cccc(n1)-c1ccc(Oc2ccc(cc2CN2CC[C@H](O)C2)C(F)(F)F)cc1
: