Target
Sodium channel protein type 9 subunit alpha
Ligand
BDBM401439
Substrate
Meas. Tech.
FLIPR Assay
IC50
384±106 nM
Citation
 Yao, JTafesse, L Carboxamide derivatives and use thereof US Patent  US10005768 Publication Date 6/26/2018 
Target
Name:
Sodium channel protein type 9 subunit alpha
Synonyms:
NENA Peripheral sodium channel 1 SCN9A_HUMAN Voltage-gated sodium channel subunit Nav1.7 hNE-Na
Type:
Protein
Mol. Mass.:
226375.97
Organism:
Homo sapiens (Human)
Description:
Q15858
Residue:
1988
  
Inhibitor
Name:
BDBM401439
Synonyms:
6-(4-(3-(azetidin-1-ylmethyl)-4- (trifluoromethyl)phenoxy)phenyl) picolinamide | US10005768, Compound 53
Type:
Small organic molecule
Emp. Form.:
C23H20F3N3O2
Mol. Mass.:
427.419
SMILES:
NC(=O)c1cccc(n1)-c1ccc(Oc2ccc(c(CN3CCC3)c2)C(F)(F)F)cc1
: