Target
Sodium channel protein type 9 subunit alpha
Ligand
BDBM401448
Substrate
Meas. Tech.
FLIPR Assay
IC50
337±56 nM
Citation
 Yao, JTafesse, L Carboxamide derivatives and use thereof US Patent  US10005768 Publication Date 6/26/2018 
Target
Name:
Sodium channel protein type 9 subunit alpha
Synonyms:
NENA Peripheral sodium channel 1 SCN9A_HUMAN Voltage-gated sodium channel subunit Nav1.7 hNE-Na
Type:
Protein
Mol. Mass.:
226375.97
Organism:
Homo sapiens (Human)
Description:
Q15858
Residue:
1988
  
Inhibitor
Name:
BDBM401448
Synonyms:
6-(4-(2-(1-hydroxy-2-nitroethyl)- 4-(trifluoromethyl)phenoxy)- phenyl)picolinamide | US10005768, Compound 63
Type:
Small organic molecule
Emp. Form.:
C21H16F3N3O5
Mol. Mass.:
447.364
SMILES:
NC(=O)c1cccc(n1)-c1ccc(Oc2ccc(cc2C(O)C[N+]([O-])=O)C(F)(F)F)cc1
: