Target
Sodium channel protein type 9 subunit alpha
Ligand
BDBM401461
Substrate
Meas. Tech.
FLIPR Assay
IC50
128±30 nM
Citation
 Yao, JTafesse, L Carboxamide derivatives and use thereof US Patent  US10005768 Publication Date 6/26/2018 
Target
Name:
Sodium channel protein type 9 subunit alpha
Synonyms:
NENA Peripheral sodium channel 1 SCN9A_HUMAN Voltage-gated sodium channel subunit Nav1.7 hNE-Na
Type:
Protein
Mol. Mass.:
226375.97
Organism:
Homo sapiens (Human)
Description:
Q15858
Residue:
1988
  
Inhibitor
Name:
BDBM401461
Synonyms:
6-(3-chloro-4-(4-fluorophenoxy)- phenyl)picolinamide | US10005768, Compound 87
Type:
Small organic molecule
Emp. Form.:
C18H12ClFN2O2
Mol. Mass.:
342.751
SMILES:
NC(=O)c1cccc(n1)-c1ccc(Oc2ccc(F)cc2)c(Cl)c1
: