Target
Sodium channel protein type 9 subunit alpha
Ligand
BDBM401473
Substrate
Meas. Tech.
FLIPR Assay
IC50
276±63 nM
Citation
 Yao, JTafesse, L Carboxamide derivatives and use thereof US Patent  US10005768 Publication Date 6/26/2018 
Target
Name:
Sodium channel protein type 9 subunit alpha
Synonyms:
NENA Peripheral sodium channel 1 SCN9A_HUMAN Voltage-gated sodium channel subunit Nav1.7 hNE-Na
Type:
Protein
Mol. Mass.:
226375.97
Organism:
Homo sapiens (Human)
Description:
Q15858
Residue:
1988
  
Inhibitor
Name:
BDBM401473
Synonyms:
6-(4'-chloro-6-(4-fluorophenoxy)- [1,1'-biphenyl]-3-yl)picolinamide | US10005768, Compound 100
Type:
Small organic molecule
Emp. Form.:
C24H16ClFN2O2
Mol. Mass.:
418.847
SMILES:
NC(=O)c1cccc(n1)-c1ccc(Oc2ccc(F)cc2)c(c1)-c1ccc(Cl)cc1
: