Target
Sodium channel protein type 9 subunit alpha
Ligand
BDBM401476
Substrate
Meas. Tech.
FLIPR Assay
IC50
312±8 nM
Citation
 Yao, JTafesse, L Carboxamide derivatives and use thereof US Patent  US10005768 Publication Date 6/26/2018 
Target
Name:
Sodium channel protein type 9 subunit alpha
Synonyms:
NENA Peripheral sodium channel 1 SCN9A_HUMAN Voltage-gated sodium channel subunit Nav1.7 hNE-Na
Type:
Protein
Mol. Mass.:
226375.97
Organism:
Homo sapiens (Human)
Description:
Q15858
Residue:
1988
  
Inhibitor
Name:
BDBM401476
Synonyms:
6-(4-(4-fluorophenoxy)-3- (methoxymethyl)phenyl)picolin- amide | US10005768, Compound 103
Type:
Small organic molecule
Emp. Form.:
C20H17FN2O3
Mol. Mass.:
352.359
SMILES:
COCc1cc(ccc1Oc1ccc(F)cc1)-c1cccc(n1)C(N)=O
: