Target
Sodium channel protein type 9 subunit alpha
Ligand
BDBM401487
Substrate
Meas. Tech.
FLIPR Assay
IC50
455±67 nM
Citation
 Yao, JTafesse, L Carboxamide derivatives and use thereof US Patent  US10005768 Publication Date 6/26/2018 
Target
Name:
Sodium channel protein type 9 subunit alpha
Synonyms:
NENA Peripheral sodium channel 1 SCN9A_HUMAN Voltage-gated sodium channel subunit Nav1.7 hNE-Na
Type:
Protein
Mol. Mass.:
226375.97
Organism:
Homo sapiens (Human)
Description:
Q15858
Residue:
1988
  
Inhibitor
Name:
BDBM401487
Synonyms:
(R)-1-(2-(4-(2-(pyrrolidin-1- ylmethyl)-4- (trifluoromethyl)phenoxy)phenyl) pyrimidin-4-yl)ethane-1,2-diol | US10005768, Compound 115
Type:
Small organic molecule
Emp. Form.:
C24H24F3N3O3
Mol. Mass.:
459.4609
SMILES:
OC[C@H](O)c1ccnc(n1)-c1ccc(Oc2ccc(cc2CN2CCCC2)C(F)(F)F)cc1
: