Target
Sodium channel protein type 9 subunit alpha
Ligand
BDBM401489
Substrate
Meas. Tech.
FLIPR Assay
IC50
66.0±7 nM
Citation
 Yao, JTafesse, L Carboxamide derivatives and use thereof US Patent  US10005768 Publication Date 6/26/2018 
Target
Name:
Sodium channel protein type 9 subunit alpha
Synonyms:
NENA Peripheral sodium channel 1 SCN9A_HUMAN Voltage-gated sodium channel subunit Nav1.7 hNE-Na
Type:
Protein
Mol. Mass.:
226375.97
Organism:
Homo sapiens (Human)
Description:
Q15858
Residue:
1988
  
Inhibitor
Name:
BDBM401489
Synonyms:
6-(4-(2- ((ethyl(methyl)amino)methyl)-4- (trifluoromethyl)phenoxy)phenyl) picolinamide | US10005768, Compound 117
Type:
Small organic molecule
Emp. Form.:
C23H22F3N3O2
Mol. Mass.:
429.4349
SMILES:
CCN(C)Cc1cc(ccc1Oc1ccc(cc1)-c1cccc(n1)C(N)=O)C(F)(F)F
: