Target
Sodium channel protein type 9 subunit alpha
Ligand
BDBM401490
Substrate
Meas. Tech.
FLIPR Assay
IC50
118±12 nM
Citation
 Yao, JTafesse, L Carboxamide derivatives and use thereof US Patent  US10005768 Publication Date 6/26/2018 
Target
Name:
Sodium channel protein type 9 subunit alpha
Synonyms:
NENA Peripheral sodium channel 1 SCN9A_HUMAN Voltage-gated sodium channel subunit Nav1.7 hNE-Na
Type:
Protein
Mol. Mass.:
226375.97
Organism:
Homo sapiens (Human)
Description:
Q15858
Residue:
1988
  
Inhibitor
Name:
BDBM401490
Synonyms:
6-(4-(2-((diethylamino)methyl)-4- (trifluoromethyl)phenoxy)phenyl) picolinamide | US10005768, Compound 118
Type:
Small organic molecule
Emp. Form.:
C24H24F3N3O2
Mol. Mass.:
443.4615
SMILES:
CCN(CC)Cc1cc(ccc1Oc1ccc(cc1)-c1cccc(n1)C(N)=O)C(F)(F)F
: