Target
Sodium channel protein type 9 subunit alpha
Ligand
BDBM401509
Substrate
Meas. Tech.
FLIPR Assay
IC50
367±28 nM
Citation
 Yao, JTafesse, L Carboxamide derivatives and use thereof US Patent  US10005768 Publication Date 6/26/2018 
Target
Name:
Sodium channel protein type 9 subunit alpha
Synonyms:
NENA Peripheral sodium channel 1 SCN9A_HUMAN Voltage-gated sodium channel subunit Nav1.7 hNE-Na
Type:
Protein
Mol. Mass.:
226375.97
Organism:
Homo sapiens (Human)
Description:
Q15858
Residue:
1988
  
Inhibitor
Name:
BDBM401509
Synonyms:
2-(6-carbmoyl-2-(4-(2- ((diethylamino)methyl)-4- (trifluoromethyl)phenoxy)phenyl) pyrimidin-4-yl)ethyl acetate | US10005768, Compound 124
Type:
Small organic molecule
Emp. Form.:
C27H29F3N4O4
Mol. Mass.:
530.5388
SMILES:
CCN(CC)Cc1cc(ccc1Oc1ccc(cc1)-c1nc(CCOC(C)=O)cc(n1)C(N)=O)C(F)(F)F
: