Target
Sodium channel protein type 9 subunit alpha
Ligand
BDBM401511
Substrate
Meas. Tech.
FLIPR Assay
IC50
288±45 nM
Citation
 Yao, JTafesse, L Carboxamide derivatives and use thereof US Patent  US10005768 Publication Date 6/26/2018 
Target
Name:
Sodium channel protein type 9 subunit alpha
Synonyms:
NENA Peripheral sodium channel 1 SCN9A_HUMAN Voltage-gated sodium channel subunit Nav1.7 hNE-Na
Type:
Protein
Mol. Mass.:
226375.97
Organism:
Homo sapiens (Human)
Description:
Q15858
Residue:
1988
  
Inhibitor
Name:
BDBM401511
Synonyms:
(S)-2-(4-(2-(1-methyl-1H- pyrazol-5-yl)-4- (trifluoromethyl)phenoxy)phenyl)- 6-((2-oxopyrrolidin-3- yl)amino)pyrimidine-4- carboxamide | US10005768, Compound 126
Type:
Small organic molecule
Emp. Form.:
C26H22F3N7O3
Mol. Mass.:
537.4932
SMILES:
Cn1nccc1-c1cc(ccc1Oc1ccc(cc1)-c1nc(N[C@H]2CCNC2=O)cc(n1)C(N)=O)C(F)(F)F
: