Target
Sodium channel protein type 9 subunit alpha
Ligand
BDBM401512
Substrate
Meas. Tech.
FLIPR Assay
IC50
486±32 nM
Citation
 Yao, JTafesse, L Carboxamide derivatives and use thereof US Patent  US10005768 Publication Date 6/26/2018 
Target
Name:
Sodium channel protein type 9 subunit alpha
Synonyms:
NENA Peripheral sodium channel 1 SCN9A_HUMAN Voltage-gated sodium channel subunit Nav1.7 hNE-Na
Type:
Protein
Mol. Mass.:
226375.97
Organism:
Homo sapiens (Human)
Description:
Q15858
Residue:
1988
  
Inhibitor
Name:
BDBM401512
Synonyms:
6-(2-(1H-imidazol-1-yl)ethyl)-2- (4-(2-(morpholinomethyl)-4- (trifluoromethyl)phenoxy)phenyl) pyrimidine-4-carboxamide | US10005768, Compound 127
Type:
Small organic molecule
Emp. Form.:
C28H27F3N6O3
Mol. Mass.:
552.5476
SMILES:
NC(=O)c1cc(CCn2ccnc2)nc(n1)-c1ccc(Oc2ccc(cc2CN2CCOCC2)C(F)(F)F)cc1
: