Target
Sodium channel protein type 9 subunit alpha
Ligand
BDBM401519
Substrate
Meas. Tech.
FLIPR Assay
IC50
393±48 nM
Citation
 Yao, JTafesse, L Carboxamide derivatives and use thereof US Patent  US10005768 Publication Date 6/26/2018 
Target
Name:
Sodium channel protein type 9 subunit alpha
Synonyms:
NENA Peripheral sodium channel 1 SCN9A_HUMAN Voltage-gated sodium channel subunit Nav1.7 hNE-Na
Type:
Protein
Mol. Mass.:
226375.97
Organism:
Homo sapiens (Human)
Description:
Q15858
Residue:
1988
  
Inhibitor
Name:
BDBM401519
Synonyms:
(S)-6-((1-amino-1-oxopropan-2- yl)amino)-2-(4-(2-(5- (dimethylamino)pyrazin-2-yl)-4- (trifluoromethyl)phenoxy)phenyl) pyrimidine-4-carboxamide | US10005768, Compound 134
Type:
Small organic molecule
Emp. Form.:
C27H25F3N8O3
Mol. Mass.:
566.5344
SMILES:
C[C@H](Nc1cc(nc(n1)-c1ccc(Oc2ccc(cc2-c2cnc(cn2)N(C)C)C(F)(F)F)cc1)C(N)=O)C(N)=O
: