Target
Sodium channel protein type 9 subunit alpha
Ligand
BDBM401526
Substrate
Meas. Tech.
FLIPR Assay
IC50
450±53 nM
Citation
 Yao, JTafesse, L Carboxamide derivatives and use thereof US Patent  US10005768 Publication Date 6/26/2018 
Target
Name:
Sodium channel protein type 9 subunit alpha
Synonyms:
NENA Peripheral sodium channel 1 SCN9A_HUMAN Voltage-gated sodium channel subunit Nav1.7 hNE-Na
Type:
Protein
Mol. Mass.:
226375.97
Organism:
Homo sapiens (Human)
Description:
Q15858
Residue:
1988
  
Inhibitor
Name:
BDBM401526
Synonyms:
(S)-2-(4-(4-chloro-2-(1-methyl- 1H-pyrazol-5- yl)phenoxy)phenyl)-6-((2- oxopyrrolidin-3-yl)amino)- pyrimidine-4-carboxamide | US10005768, Compound 141
Type:
Small organic molecule
Emp. Form.:
C25H22ClN7O3
Mol. Mass.:
503.94
SMILES:
Cn1nccc1-c1cc(Cl)ccc1Oc1ccc(cc1)-c1nc(N[C@H]2CCNC2=O)cc(n1)C(N)=O
: