Target
Dual specificity tyrosine-phosphorylation-regulated kinase 1B
Ligand
BDBM401589
Substrate
Meas. Tech.
Kinase Assay
IC50
14.4±n/a nM
Citation
 Leban, JZaja, M 2,3-dihydrobenzofuran-5YL compounds as DYRK kinase inhibitors US Patent  US10005769 Publication Date 6/26/2018 
Target
Name:
Dual specificity tyrosine-phosphorylation-regulated kinase 1B
Synonyms:
DYR1B_HUMAN Dual specificity tyrosine-phosphorylation-regulated kinase 1B MIRK
Type:
Enzyme
Mol. Mass.:
69222.24
Organism:
Homo sapiens (Human)
Description:
Q9Y463
Residue:
629
  
Inhibitor
Name:
BDBM401589
Synonyms:
US10005769, No. 53
Type:
Small organic molecule
Emp. Form.:
C22H23N5O4S2
Mol. Mass.:
485.579
SMILES:
CCOC(=O)C1CCN(CC1)c1nnc(NC(=O)c2csc(n2)-c2ccc3OCCc3c2)s1
: