Target
Tyrosine-protein kinase BTK
Ligand
BDBM249883
Substrate
Meas. Tech.
Kinase Assay
IC50
0.510±n/a nM
Citation
 Wang, ZGuo, Y Substituted pyrazolo[1,5-a]pyrimidines as bruton's tyrosine kinase modulators US Patent  US10005782 Publication Date 6/26/2018 
Target
Name:
Tyrosine-protein kinase BTK
Synonyms:
AGMX1 Agammaglobulinaemia tyrosine kinase B cell progenitor kinase BPK BTK_HUMAN Tyrosine Kinase BTK Tyrosine-protein kinase BTK (BTK)
Type:
Enzyme
Mol. Mass.:
76289.95
Organism:
Homo sapiens (Human)
Description:
Q06187
Residue:
659
  
Inhibitor
Name:
BDBM249883
Synonyms:
US10005782, Compound 10b US9556188, Compound 10
Type:
Small organic molecule
Emp. Form.:
C29H27N5O3
Mol. Mass.:
493.5564
SMILES:
NC(=O)c1c2NCCC(c3ccccc3NC(=O)C=C)n2nc1-c1ccc(OCc2ccccc2)cc1
: