Target
Tyrosine-protein kinase BTK
Ligand
BDBM249925
Substrate
Meas. Tech.
Kinase Assay
IC50
0.140±n/a nM
Citation
 Wang, ZGuo, Y Substituted pyrazolo[1,5-a]pyrimidines as bruton's tyrosine kinase modulators US Patent  US10005782 Publication Date 6/26/2018 
Target
Name:
Tyrosine-protein kinase BTK
Synonyms:
AGMX1 Agammaglobulinaemia tyrosine kinase B cell progenitor kinase BPK BTK_HUMAN Tyrosine Kinase BTK Tyrosine-protein kinase BTK (BTK)
Type:
Enzyme
Mol. Mass.:
76289.95
Organism:
Homo sapiens (Human)
Description:
Q06187
Residue:
659
  
Inhibitor
Name:
BDBM249925
Synonyms:
US10005782, Compound 52 US9556188, Compound 52
Type:
Small organic molecule
Emp. Form.:
C24H21N5O3
Mol. Mass.:
427.4552
SMILES:
NC(=O)c1c(nn2c3CN(CCc3[nH]c12)C(=O)C=C)-c1ccc(Oc2ccccc2)cc1
: