Target
Tyrosine-protein kinase BTK
Ligand
BDBM249927
Substrate
Meas. Tech.
Kinase Assay
IC50
0.190±n/a nM
Citation
 Wang, ZGuo, Y Substituted pyrazolo[1,5-a]pyrimidines as bruton's tyrosine kinase modulators US Patent  US10005782 Publication Date 6/26/2018 
Target
Name:
Tyrosine-protein kinase BTK
Synonyms:
AGMX1 Agammaglobulinaemia tyrosine kinase B cell progenitor kinase BPK BTK_HUMAN Tyrosine Kinase BTK Tyrosine-protein kinase BTK (BTK)
Type:
Enzyme
Mol. Mass.:
76289.95
Organism:
Homo sapiens (Human)
Description:
Q06187
Residue:
659
  
Inhibitor
Name:
BDBM249927
Synonyms:
US10005782, Compound 54 US9556188, Compound 54
Type:
Small organic molecule
Emp. Form.:
C27H28N6O3
Mol. Mass.:
484.5496
SMILES:
CN(C)C\C=C\C(=O)N1CCc2[nH]c3c(C(N)=O)c(nn3c2C1)-c1ccc(Oc2ccccc2)cc1
: