Target
Tyrosine-protein kinase BTK
Ligand
BDBM249971
Substrate
Meas. Tech.
Kinase Assay
IC50
1.10±n/a nM
Citation
 Wang, ZGuo, Y Substituted pyrazolo[1,5-a]pyrimidines as bruton's tyrosine kinase modulators US Patent  US10005782 Publication Date 6/26/2018 
Target
Name:
Tyrosine-protein kinase BTK
Synonyms:
AGMX1 Agammaglobulinaemia tyrosine kinase B cell progenitor kinase BPK BTK_HUMAN Tyrosine Kinase BTK Tyrosine-protein kinase BTK (BTK)
Type:
Enzyme
Mol. Mass.:
76289.95
Organism:
Homo sapiens (Human)
Description:
Q06187
Residue:
659
  
Inhibitor
Name:
BDBM249971
Synonyms:
US10005782, Compound 97 US9556188, Compound 97
Type:
Small organic molecule
Emp. Form.:
C28H24ClN5O3
Mol. Mass.:
513.975
SMILES:
NC(=O)c1c2NCCC(c3ccc(Cl)c(NC(=O)C=C)c3)n2nc1-c1ccc(Oc2ccccc2)cc1
: