Target
Tyrosine-protein kinase BTK
Ligand
BDBM401749
Substrate
Meas. Tech.
Kinase Assay
IC50
1.000±n/a nM
Citation
 Wang, ZGuo, Y Substituted pyrazolo[1,5-a]pyrimidines as bruton's tyrosine kinase modulators US Patent  US10005782 Publication Date 6/26/2018 
Target
Name:
Tyrosine-protein kinase BTK
Synonyms:
AGMX1 Agammaglobulinaemia tyrosine kinase B cell progenitor kinase BPK BTK_HUMAN Tyrosine Kinase BTK Tyrosine-protein kinase BTK (BTK)
Type:
Enzyme
Mol. Mass.:
76289.95
Organism:
Homo sapiens (Human)
Description:
Q06187
Residue:
659
  
Inhibitor
Name:
BDBM401749
Synonyms:
Cis-7-acryloyl- 2-(4- phenoxyphenyl)- 5,5a,6,7,8,8a- hexahydro-4H- pyrazolo[1,5- a]pyrrolo[3,4- e]pyrimidine-3- carboxamide | US10005782, Compound 116
Type:
Small organic molecule
Emp. Form.:
C24H23N5O3
Mol. Mass.:
429.4711
SMILES:
NC(=O)c1c2NC[C@H]3CN(C[C@H]3n2nc1-c1ccc(Oc2ccccc2)cc1)C(=O)C=C
: