Target
Tyrosine-protein kinase BTK
Ligand
BDBM250035
Substrate
Meas. Tech.
Kinase Assay
IC50
0.380±n/a nM
Citation
 Wang, ZGuo, Y Substituted pyrazolo[1,5-a]pyrimidines as bruton's tyrosine kinase modulators US Patent  US10005782 Publication Date 6/26/2018 
Target
Name:
Tyrosine-protein kinase BTK
Synonyms:
AGMX1 Agammaglobulinaemia tyrosine kinase B cell progenitor kinase BPK BTK_HUMAN Tyrosine Kinase BTK Tyrosine-protein kinase BTK (BTK)
Type:
Enzyme
Mol. Mass.:
76289.95
Organism:
Homo sapiens (Human)
Description:
Q06187
Residue:
659
  
Inhibitor
Name:
BDBM250035
Synonyms:
US10005782, Compound 157 US9556188, Compound 157
Type:
Small organic molecule
Emp. Form.:
C23H22FN5O2
Mol. Mass.:
419.4515
SMILES:
Cc1cc(ccc1F)-c1nn2C(CCNc2c1C(N)=O)c1ccccc1NC(=O)C=C
: