Target
Tyrosine-protein kinase BTK
Ligand
BDBM250038
Substrate
Meas. Tech.
Kinase Assay
IC50
0.490±n/a nM
Citation
 Wang, ZGuo, Y Substituted pyrazolo[1,5-a]pyrimidines as bruton's tyrosine kinase modulators US Patent  US10005782 Publication Date 6/26/2018 
Target
Name:
Tyrosine-protein kinase BTK
Synonyms:
AGMX1 Agammaglobulinaemia tyrosine kinase B cell progenitor kinase BPK BTK_HUMAN Tyrosine Kinase BTK Tyrosine-protein kinase BTK (BTK)
Type:
Enzyme
Mol. Mass.:
76289.95
Organism:
Homo sapiens (Human)
Description:
Q06187
Residue:
659
  
Inhibitor
Name:
BDBM250038
Synonyms:
US10005782, Compound 160 US9556188, Compound 160
Type:
Small organic molecule
Emp. Form.:
C23H22ClN5O3
Mol. Mass.:
451.905
SMILES:
COc1cc(ccc1Cl)-c1nn2C(CCNc2c1C(N)=O)c1ccccc1NC(=O)C=C
: