Target
Tyrosine-protein kinase BTK
Ligand
BDBM250050
Substrate
Meas. Tech.
Kinase Assay
IC50
1.10±n/a nM
Citation
 Wang, ZGuo, Y Substituted pyrazolo[1,5-a]pyrimidines as bruton's tyrosine kinase modulators US Patent  US10005782 Publication Date 6/26/2018 
Target
Name:
Tyrosine-protein kinase BTK
Synonyms:
AGMX1 Agammaglobulinaemia tyrosine kinase B cell progenitor kinase BPK BTK_HUMAN Tyrosine Kinase BTK Tyrosine-protein kinase BTK (BTK)
Type:
Enzyme
Mol. Mass.:
76289.95
Organism:
Homo sapiens (Human)
Description:
Q06187
Residue:
659
  
Inhibitor
Name:
BDBM250050
Synonyms:
US10005782, Compound 172 US9556188, Compound 172
Type:
Small organic molecule
Emp. Form.:
C28H31N5O4
Mol. Mass.:
501.5768
SMILES:
COc1cc(ccc1Oc1ccccc1)-c1nn2C(CCNc2c1C(N)=O)C1CCN(CC1)C(=O)C=C
: