Target
Tyrosine-protein kinase BTK
Ligand
BDBM250061
Substrate
Meas. Tech.
Kinase Assay
IC50
1.10±n/a nM
Citation
 Wang, ZGuo, Y Substituted pyrazolo[1,5-a]pyrimidines as bruton's tyrosine kinase modulators US Patent  US10005782 Publication Date 6/26/2018 
Target
Name:
Tyrosine-protein kinase BTK
Synonyms:
AGMX1 Agammaglobulinaemia tyrosine kinase B cell progenitor kinase BPK BTK_HUMAN Tyrosine Kinase BTK Tyrosine-protein kinase BTK (BTK)
Type:
Enzyme
Mol. Mass.:
76289.95
Organism:
Homo sapiens (Human)
Description:
Q06187
Residue:
659
  
Inhibitor
Name:
BDBM250061
Synonyms:
US10005782, Compound 186 US9556188, Compound 186
Type:
Small organic molecule
Emp. Form.:
C29H31N5O3
Mol. Mass.:
497.5881
SMILES:
CCC#CC(=O)N1CCC(CC1)[C@@H]1CCNc2c(C(N)=O)c(nn12)-c1ccc(Oc2ccccc2)cc1
: