Target
Substance-P receptor
Ligand
BDBM261484
Substrate
Meas. Tech.
Receptor Binding Assay
IC50
1.63±n/a nM
Citation
 Shimizu, KOhno, KMiyagi, TUeno, YSuzuki, H Cyclohexyl pyridine derivative US Patent  US10011568 Publication Date 7/3/2018 
Target
Name:
Substance-P receptor
Synonyms:
NK-1 receptor NK1 Receptor NK1R_HUMAN Neurokinin-1 (NK-1) SPR TACR1 Tachykinin receptor 1 (NK1) | tachykinin
Type:
G Protein-Coupled Receptor (GPCR)
Mol. Mass.:
46254.43
Organism:
Homo sapiens (Human)
Description:
P25103
Residue:
407
  
Inhibitor
Name:
BDBM261484
Synonyms:
US10011568, Ex. No. 7 | US9708266, 7
Type:
Small organic molecule
Emp. Form.:
C34H33F7N2O3
Mol. Mass.:
650.6262
SMILES:
CN(C(=O)C(C)(C)c1cc(cc(c1)C(F)(F)F)C(F)(F)F)c1cnc(cc1-c1ccc(F)cc1C)C1CCC2(CC2C(O)=O)CC1
: