Target
Sodium/glucose cotransporter 1
Ligand
BDBM402285
Substrate
Meas. Tech.
Inhibitory Activity Assay
IC50
0.580±n/a nM
Citation
 Zhong, HLiao, JYu, HXu, YLi, QChen, JGao, PTan, SWang, S C-aryl glucoside derivative, preparation methods thereof, and medical applications thereof US Patent  US10011627 Publication Date 7/3/2018 
Target
Name:
Sodium/glucose cotransporter 1
Synonyms:
High affinity sodium-glucose cotransporter Na(+)/glucose cotransporter 1 SGLT1 Sodium-dependent glucose cotransporter 1 (SGLT1) Sodium/glucose cotransporter 1 (SGLT1) | Solute carrier family 5 member 1
Type:
Protein
Mol. Mass.:
73503.78
Organism:
Homo sapiens (Human)
Description:
P13866
Residue:
664
  
Inhibitor
Name:
BDBM402285
Synonyms:
US10011627, 1
Type:
Small organic molecule
Emp. Form.:
C22H23ClO8
Mol. Mass.:
450.866
SMILES:
OC[C@@]12CO[C@@](O1)([C@H](O)[C@@H](O)[C@@H]2O)c1ccc(Cl)c(Cc2ccc3OCCOc3c2)c1
: