Target
Prostaglandin E2 receptor EP1 subtype
Ligand
BDBM35857
Substrate
BDBM35847
Meas. Tech.
Prostanoid EP Receptor Binding Assay
pH
6±n/a
Temperature
298.15±n/a K
Ki
>10000±n/a nM
Citation
 Asada, MObitsu, TNagase, TSugimoto, IYamaura, YSato, KNarita, MOhuchida, SNakai, HToda, M Discovery of a series of acrylic acids and their derivatives as chemical leads for selective EP3 receptor antagonists. Bioorg Med Chem 17:6567-82 (2009)  
Target
Name:
Prostaglandin E2 receptor EP1 subtype
Synonyms:
PE2R1_MOUSE Prostaglandin E1 Prostanoid EP1 receptor Ptgerep1
Type:
G-protein coupled receptor
Mol. Mass.:
43000.62
Organism:
Mus musculus (Mouse)
Description:
Residue:
405
  
Inhibitor
Name:
BDBM35857
Synonyms:
acrylic acid derivative, 14
Type:
Small organic molecule
Emp. Form.:
C28H24O3
Mol. Mass.:
408.4884
SMILES:
OC(=O)\C=C\c1ccc(Cc2ccccc2)cc1OCCc1ccc2ccccc2c1
:
Substrate
Name:
BDBM35847
Synonyms:
(15S)-prostaglandin E2 (5Z,13E,15S)-11alpha,15-dihydroxy-9-oxoprosta-5,13-dien-1-oic acid CHEMBL548 PGE2 [3H]PGE2 prostaglandin E2
Type:
radiolabeled ligand
Emp. Form.:
C20H32O5
Mol. Mass.:
352.4651
SMILES:
CCCCC[C@H](O)\C=C\[C@H]1[C@H](O)CC(=O)[C@@H]1C\C=C/CCCC(O)=O
: