Target
Interleukin-1 receptor-associated kinase 4
Ligand
BDBM50239498
Substrate
Meas. Tech.
IRAK4 Enzymatic DELFIA Assay, Protocol A
IC50
0.300±n/a nM
Citation
 Trzupek, JDLee, KLBunnage, MEHan, SHepworth, DLovering, FEMathias, JPPapaioannou, NPierce, BSStrohbach, JWWright, SWZapf, CWGavrin, LKLee, AAnderson, DRCurran, KJDehnhardt, CMSaiah, EGoldberg, JAWang, XHuang, HVargas, RLowe, MDPatny, A Bicyclic-fused heteroaryl or aryl compounds US Patent  US10329302 Publication Date 6/25/2019 
Target
Name:
Interleukin-1 receptor-associated kinase 4
Synonyms:
IRAK-4 IRAK4_HUMAN Interleukin-1 receptor-associated kinase 4 (IRAK4) | Renal carcinoma antigen NY-REN-64
Type:
Protein
Mol. Mass.:
51519.08
Organism:
Homo sapiens (Human)
Description:
Q9NWZ3
Residue:
460
  
Inhibitor
Name:
BDBM50239498
Synonyms:
CHEMBL4093120 US10793579, Example 189 | US11702424, Example 189
Type:
Small organic molecule
Emp. Form.:
C17H18FN3O4
Mol. Mass.:
347.3409
SMILES:
COc1cc2c(OC[C@H]3NC(=O)[C@@H](F)[C@H]3C)nccc2cc1C(N)=O
: