Target
Dimer of Gag-Pol polyprotein [489-587]
Ligand
BDBM908
Substrate
Chromogenic Peptide Substrate
Meas. Tech.
Protease Inhibition Assay
pH
5.5±n/a
Temperature
310.15±n/a K
Ki
33±10 nM
Citation
 Varney, MDAppelt, KKalish, VReddy, MRTatlock, JPalmer, CLRomines, WHWu, BWMusick, L Crystal-structure-based design and synthesis of novel C-terminal inhibitors of HIV protease. J Med Chem 37:2274-84 (1994)  
Target
Name:
Dimer of Gag-Pol polyprotein [489-587]
Synonyms:
HIV-1 Protease
Type:
Protein Complex
Mol. Mass.:
Description:
Components:
This complex has 2 components.
Component 1
Name:
Gag-Pol polyprotein [489-587]
Synonyms:
HIV protease HIV-1 Protease chain A POL_HV1N5 | gag-pol
Type:
Enzyme Subunit
Mol. Mass.:
10822.21
Organism:
Human immunodeficiency virus type 1
Description:
P12497[489-587]
Residue:
99
  
Component 2
Name:
Gag-Pol polyprotein [489-587]
Synonyms:
HIV protease HIV-1 Protease chain A POL_HV1N5 | gag-pol
Type:
Enzyme Subunit
Mol. Mass.:
10822.21
Organism:
Human immunodeficiency virus type 1
Description:
P12497[489-587]
Residue:
99
  
Inhibitor
Name:
BDBM908
Synonyms:
(2S)-N-[(2S,3S)-3-hydroxy-5-({1H-indol-2-yl[3-(trifluoromethyl)phenyl]methyl}carbamoyl)-1-phenylpentan-2-yl]-2-(quinolin-2-ylformamido)butanediamide C-terminal inhibitor 6
Type:
Small organic molecule
Emp. Form.:
C42H39F3N6O5
Mol. Mass.:
764.7915
SMILES:
NC(=O)C[C@H](NC(=O)c1ccc2ccccc2n1)C(=O)N[C@@H](Cc1ccccc1)[C@@H](O)CCC(=O)NC(c1cc2ccccc2[nH]1)c1cccc(c1)C(F)(F)F
:
Substrate
Name:
Chromogenic Peptide Substrate
Synonyms:
Type:
Peptide
Mol. Mass.:
3511.92
Organism:
Description:
Residue:
33