Target
Beta-mannosidase
Ligand
BDBM36387
Substrate
Meas. Tech.
Btman2A
pH
5.6±0
Temperature
310.15±0 K
Ki
20000000±0.0 nM
Citation
 Tailford, LEOffen, WASmith, NLDumon, CMorland, CGratien, JHeck, MPStick, RVBlériot, YVasella, AGilbert, HJDavies, GJ Structural and biochemical evidence for a boat-like transition state in beta-mannosidases. Nat Chem Biol 4:306-12 (2008)  
Target
Name:
Beta-mannosidase
Synonyms:
Type:
Protien
Mol. Mass.:
99501.54
Organism:
Bacteroides thetaiotaomicron
Description:
Q8AAK6
Residue:
864
  
Inhibitor
Name:
BDBM36387
Synonyms:
(4R,5S,6R)-6-Hydroxymethyl-[1,2]oxazinane-4,5-diol, 9 | CID449101
Type:
Small organic molecule
Emp. Form.:
C5H11NO4
Mol. Mass.:
149.1451
SMILES:
OC[C@H]1ONC[C@@H](O)[C@@H]1O
: