Target
Beta-mannosidase
Ligand
BDBM36388
Substrate
Meas. Tech.
Btman2A
pH
5.6±0
Temperature
310.15±0 K
Ki
23000000±0.0 nM
Citation
 Tailford, LEOffen, WASmith, NLDumon, CMorland, CGratien, JHeck, MPStick, RVBlériot, YVasella, AGilbert, HJDavies, GJ Structural and biochemical evidence for a boat-like transition state in beta-mannosidases. Nat Chem Biol 4:306-12 (2008)  
Target
Name:
Beta-mannosidase
Synonyms:
Type:
Protien
Mol. Mass.:
99501.54
Organism:
Bacteroides thetaiotaomicron
Description:
Q8AAK6
Residue:
864
  
Inhibitor
Name:
BDBM36388
Synonyms:
BDBM36404 Octahydro-indolizine-1,6,7,8-tetraol, 13
Type:
Small organic molecule
Emp. Form.:
C8H15NO4
Mol. Mass.:
189.209
SMILES:
O[C@H]1CCN2C[C@H](O)[C@@H](O)[C@H](O)[C@@H]12
: