Target
Phospholipase D1
Ligand
BDBM36428
Substrate
Meas. Tech.
PLD1 In Vitro Enzymatic Assay
Temperature
310.15±0 K
IC50
59±0 nM
Citation
 Scott, SASelvy, PEBuck, JRCho, HPCriswell, TLThomas, ALArmstrong, MDArteaga, CLLindsley, CWBrown, HA Design of isoform-selective phospholipase D inhibitors that modulate cancer cell invasiveness. Nat Chem Biol 5:108-17 (2009)  
Target
Name:
Phospholipase D1
Synonyms:
Choline phosphatase 1 PLD1 Phosphatidylcholine-hydrolyzing phospholipase D1 Phospholipase D1 Phospholipase D2 (PLD2) | hPLD1
Type:
Protein
Mol. Mass.:
124219.92
Organism:
Homo sapiens (Human)
Description:
Q13393
Residue:
1074
  
Inhibitor
Name:
BDBM36428
Synonyms:
3,4,5-Trimethoxy-N-(2-(4-(2-oxo-2,3-dihydro-1H-benzo[d]imidazol-1-yl)piperidin-1-yl)ethyl)benzamide, 55 | CID25105703
Type:
Small organic molecule
Emp. Form.:
C24H30N4O5
Mol. Mass.:
454.5188
SMILES:
COc1cc(cc(OC)c1OC)C(=O)NCCN1CCC(CC1)n1c2ccccc2[nH]c1=O
: