Target
Mitogen-activated protein kinase 14
Ligand
BDBM36489
Substrate
Meas. Tech.
Kinase Activity Assay
pH
7±0
IC50
7.1e+2±n/a nM
Kd
7.6e+2±n/a nM
Citation
 Chen, JZhang, ZStebbins, JLZhang, XHoffman, RMoore, APellecchia, M A fragment-based approach for the discovery of isoform-specific p38alpha inhibitors. ACS Chem Biol 2:329-36 (2007)  
Target
Name:
Mitogen-activated protein kinase 14
Synonyms:
CSAID-binding protein CSBP1 CSPB1 MAP kinase 14 MAP kinase p38 alpha MAPK14 MK14_HUMAN Mitogen-activated protein kinase p38 alpha Stress-activated protein kinase 2a | p38 MAP kinase alpha/beta
Type:
Serine/threonine-protein kinase
Mol. Mass.:
41286.76
Organism:
Homo sapiens (Human)
Description:
Q16539
Residue:
360
  
Inhibitor
Name:
BDBM36489
Synonyms:
BI-12H11
Type:
Small organic molecule
Emp. Form.:
C20H23N3O2S2
Mol. Mass.:
401.546
SMILES:
CN1SC(=C)c2cc(ccc12)S(=O)(=O)Nc1ccccc1N1CCCCC1
: