Target
Vitamin D-binding protein
Ligand
BDBM36717
Substrate
Meas. Tech.
DBP Binding Assay
pH
7.4±0
Temperature
277.15±0 K
IC50
40±0.0 nM
Citation
 Boehm, MFFitzgerald, PZou, AElgort, MGBischoff, EDMere, LMais, DEBissonnette, RPHeyman, RANadzan, AMReichman, MAllegretto, EA Novel nonsecosteroidal vitamin D mimics exert VDR-modulating activities with less calcium mobilization than 1,25-dihydroxyvitamin D3. Chem Biol 6:265-75 (1999)  
Target
Name:
Vitamin D-binding protein
Synonyms:
Dbp Gc-globulin VDB | VTDB_RAT
Type:
PROTEIN
Mol. Mass.:
53539.97
Organism:
Rattus norvegicus
Description:
EBI_10076
Residue:
476
  
Inhibitor
Name:
BDBM36717
Synonyms:
1,25(OH)2D3
Type:
Small organic molecule
Emp. Form.:
C30H50O
Mol. Mass.:
426.7174
SMILES:
CC(CCCC(C)(C)O)C1CCC2CC(CCC12C)\C=C\C=C1\C[C@@H](C)C[C@H](C)C1=C
: