Target
Protein-tyrosine kinase 6
Ligand
BDBM13336
Substrate
Meas. Tech.
Kinase Inhibitor Selectivity Profiling Assay
Kd
3900±n/a nM
Citation
 PubChem, PC Kinase Inhibitor Selectivity Profiling Assay PubChem Bioassay (2008)[AID] 
Target
Name:
Protein-tyrosine kinase 6
Synonyms:
BRK KH domain-containing, RNA-binding, signal transduction-associated protein 1 PTK6_HUMAN Tyrosine Kinase BRK Tyrosine-protein kinase BRK
Type:
Tyrosine-protein kinase
Mol. Mass.:
51839.11
Organism:
Homo sapiens (Human)
Description:
Residue:
451
  
Inhibitor
Name:
BDBM13336
Synonyms:
4-[4-(4-fluorophenyl)-2-(4-methanesulfinylphenyl)-1H-imidazol-5-yl]pyridine 4-{4-(4-fluorophenyl)-2-[4-(methylsulfinyl)phenyl]-1H-imidazol-5-yl}pyridine SB-203580 cid_176155
Type:
Small organic molecule
Emp. Form.:
C21H16FN3OS
Mol. Mass.:
377.435
SMILES:
CS(=O)c1ccc(cc1)-c1nc(c([nH]1)-c1ccc(F)cc1)-c1ccncc1
: