Target
Epidermal growth factor receptor [1-999,L858R]
Ligand
BDBM31085
Substrate
Meas. Tech.
Kinase Inhibitor Selectivity Profiling Assay
Kd
2600000±n/a nM
Citation
 PubChem, PC Kinase Inhibitor Selectivity Profiling Assay PubChem Bioassay (2008)[AID] 
Target
Name:
Epidermal growth factor receptor [1-999,L858R]
Synonyms:
EGFR EGFR_HUMAN ERBB1 | HER1
Type:
Enzyme Catalytic Domain
Mol. Mass.:
111216.35
Organism:
Homo sapiens (Human)
Description:
P00533[1-999,L858R]
Residue:
999
  
Inhibitor
Name:
BDBM31085
Synonyms:
1-[4-[(4-ethyl-1-piperazinyl)methyl]-3-(trifluoromethyl)phenyl]-3-[4-[[6-(methylamino)-4-pyrimidinyl]oxy]phenyl]urea 1-[4-[(4-ethylpiperazino)methyl]-3-(trifluoromethyl)phenyl]-3-[4-[6-(methylamino)pyrimidin-4-yl]oxyphenyl]urea cid_11409972
Type:
Small organic molecule
Emp. Form.:
C26H30F3N7O2
Mol. Mass.:
529.5573
SMILES:
CCN1CCN(Cc2ccc(NC(=O)Nc3ccc(Oc4cc(NC)ncn4)cc3)cc2C(F)(F)F)CC1
: