Target
Fibroblast growth factor receptor 4
Ligand
BDBM88665
Substrate
Meas. Tech.
Omnia Assay
pH
7.5±n/a
IC50
<100±n/a nM
Comments
extracted
Citation
 D'Agostino, LASjin, RTNiu, DMcDonald, JJZhu, ZLiu, HMazdiyasni, HPetter, RCSingh, JBarrague, MGross, AMunson, M Heteroaryl compounds and uses thereof US Patent  US9695132 Publication Date 7/4/2017 
Target
Name:
Fibroblast growth factor receptor 4
Synonyms:
CD_antigen: CD334 FGFR4 FGFR4 Fibroblast growth factor receptor JK2 TKF
Type:
Protein
Mol. Mass.:
87957.45
Organism:
Homo sapiens (Human)
Description:
P22455
Residue:
802
  
Inhibitor
Name:
BDBM88665
Synonyms:
US10189794, Compound I-28 US10774052, Compound I-28 | US9695132, I-28
Type:
Small organic molecule
Emp. Form.:
C31H28Cl2N6O5
Mol. Mass.:
635.497
SMILES:
COc1cccc(CN2C(=O)N(Cc3cnc(Nc4ccccc4NC(=O)C=C)nc23)c2c(Cl)c(OC)cc(OC)c2Cl)c1
: