Target
Fibroblast growth factor receptor 4
Ligand
BDBM91597
Substrate
Meas. Tech.
Omnia Assay
pH
7.5±n/a
IC50
>1000±n/a nM
Comments
extracted
Citation
 D'Agostino, LASjin, RTNiu, DMcDonald, JJZhu, ZLiu, HMazdiyasni, HPetter, RCSingh, JBarrague, MGross, AMunson, M Heteroaryl compounds and uses thereof US Patent  US9695132 Publication Date 7/4/2017 
Target
Name:
Fibroblast growth factor receptor 4
Synonyms:
CD_antigen: CD334 FGFR4 FGFR4 Fibroblast growth factor receptor JK2 TKF
Type:
Protein
Mol. Mass.:
87957.45
Organism:
Homo sapiens (Human)
Description:
P22455
Residue:
802
  
Inhibitor
Name:
BDBM91597
Synonyms:
US10189794, Compound I-51 US10774052, Compound I-51 | US9695132, I-51
Type:
Small organic molecule
Emp. Form.:
C19H20N6O2
Mol. Mass.:
364.4011
SMILES:
CN1C(=O)N(Cc2cnc(Nc3ccccc3NC(=O)C=C)nc12)C1CC1
: