Target
Mitogen-activated protein kinase kinase kinase kinase 4
Ligand
BDBM13336
Substrate
Meas. Tech.
Kinase Inhibitor Selectivity Profiling Assay
Kd
3700±n/a nM
Citation
 PubChem, PC Kinase Inhibitor Selectivity Profiling Assay PubChem Bioassay (2008)[AID] 
Target
Name:
Mitogen-activated protein kinase kinase kinase kinase 4
Synonyms:
HGK KIAA0687 MAP4K4 MAPK/ERK kinase kinase kinase 4 MEKKK 4 NIK | Nck-interacting kinase
Type:
Serine/threonine-protein kinase
Mol. Mass.:
142114.73
Organism:
Homo sapiens (Human)
Description:
O95819
Residue:
1239
  
Inhibitor
Name:
BDBM13336
Synonyms:
4-[4-(4-fluorophenyl)-2-(4-methanesulfinylphenyl)-1H-imidazol-5-yl]pyridine 4-{4-(4-fluorophenyl)-2-[4-(methylsulfinyl)phenyl]-1H-imidazol-5-yl}pyridine SB-203580 cid_176155
Type:
Small organic molecule
Emp. Form.:
C21H16FN3OS
Mol. Mass.:
377.435
SMILES:
CS(=O)c1ccc(cc1)-c1nc(c([nH]1)-c1ccc(F)cc1)-c1ccncc1
: