Target
Mitogen-activated protein kinase 11
Ligand
BDBM13533
Substrate
Meas. Tech.
Kinase Inhibitor Selectivity Profiling Assay
Kd
1500±n/a nM
Citation
 PubChem, PC Kinase Inhibitor Selectivity Profiling Assay PubChem Bioassay (2008)[AID] 
Target
Name:
Mitogen-activated protein kinase 11
Synonyms:
MAP kinase p38 MK11_HUMAN Mitogen-activated protein kinase p38 beta SAPK2 Stress-activated protein kinase 2 p38-2 p38b
Type:
Enzyme Catalytic Domain
Mol. Mass.:
41351.73
Organism:
Homo sapiens (Human)
Description:
gi_20128774
Residue:
364
  
Inhibitor
Name:
BDBM13533
Synonyms:
1-[2-(4-methylphenyl)-5-tert-butyl-pyrazol-3-yl]-3-[4-(2-morpholin-4-ylethoxy)naphthalen-1-yl]urea 1-[5-tert-butyl-2-(4-methylphenyl)pyrazol-3-yl]-3-[4-(2-morpholin-4-ylethoxy)naphthalen-1-yl]urea 3-[2-(4-methylphenyl)-5-tert-butyl-pyrazol-3-yl]-1-[4-(2-morpholin-4-ylethoxy)naphthalen-1-yl]urea BIRB 796 BIRB-796, 3 D3RKN_73 US11407771, Compound 43 US9187470, 43 (BIRB-796) US9260410, BIRB796 diaryl urea compound 10
Type:
Small organic molecule
Emp. Form.:
C31H37N5O3
Mol. Mass.:
527.6572
SMILES:
Cc1ccc(cc1)-n1nc(cc1NC(=O)Nc1ccc(OCCN2CCOCC2)c2ccccc12)C(C)(C)C
: