Target
Tyrosine-protein kinase JAK1 [866-1154]
Ligand
BDBM264182
Substrate
Meas. Tech.
JAK Enzymatic Assay
pH
7.3±n/a
IC50
30.0±n/a nM
Comments
extracted
Citation
 Grimster, NKawatkar, SKettle, JGSu, QVasbinder, MChuaqui, CE Compounds and methods for inhibiting JAK US Patent  US9714236 Publication Date 7/25/2017 
Target
Name:
Tyrosine-protein kinase JAK1 [866-1154]
Synonyms:
JAK1 JAK1A JAK1_HUMAN Tyrosine-protein kinase JAK1 (aa 866-1154)
Type:
Protein
Mol. Mass.:
33185.74
Organism:
Homo sapiens (Human)
Description:
P23458[866-1154]
Residue:
289
  
Inhibitor
Name:
BDBM264182
Synonyms:
(2R)-2-[(2R)-3,4- dimethylpiperazin-1- yl]-N-(3-{5-fluoro-2- [(3-methoxy-1- methyl-1H-pyrazol-4- yl)amino]pyrimidin- 4-yl}-1H-indol-7- yl)propanamide US10654835, Example 6 US9714236, 6
Type:
Small organic molecule
Emp. Form.:
C26H32FN9O2
Mol. Mass.:
521.5898
SMILES:
COc1nn(C)cc1Nc1ncc(F)c(n1)-c1c[nH]c2c(NC(=O)[C@@H](C)N3CCN(C)C[C@H]3C)cccc12
: